BDBM50066341 (S)-1-[(R)-2-Cyclohexyl-2-(diethylcarbamoylmethyl-amino)-acetyl]-pyrrolidine-2-carboxylic acid 2-chloro-benzylamide::CHEMBL108771
SMILES CCN(CC)C(=O)CN[C@H](C1CCCCC1)C(=O)N1CCC[C@H]1C(=O)NCc1ccccc1Cl
InChI Key InChIKey=OQSSNFYWAFZEHG-LADGPHEKSA-N
Data  1 KI
  Tab Delimited (TSV)   2D SDfile   Computed 3D by Vconf -m prep SDfile
Find this compound or compounds like it in BindingDB:
Activity Spreadsheet -- Enzyme Inhibition Constant Data from BindingDB
Found 1 hit for monomerid = 50066341
TargetProthrombin(Homo sapiens (Human))
Merck Research Laboratories
Curated by ChEMBL
LigandPNGBDBM50066341((S)-1-[(R)-2-Cyclohexyl-2-(diethylcarbamoylmethyl-...)
Affinity DataKi:  20nM. Assay description: Binding affinity of the compound was evaluated on serine protease thrombin.
In DepthDetails ArticlePubMed