BDBM50066767 (3R,6R,8aS)-6-Amino-5-oxo-hexahydro-thiazolo[3,2-a]pyridine-3-carboxylic acid (4-guanidino-butyl)-amide; TFA::CHEMBL332426
SMILES N[C@@H]1CC[C@@H]2SC[C@H](N2C1=O)C(=O)NCCCCNC(N)=N
InChI Key InChIKey=BKWDBVATEVWOQC-UTLUCORTSA-N
Data  2 KI
  Tab Delimited (TSV)   2D SDfile   Computed 3D by Vconf -m prep SDfile
Find this compound or compounds like it in BindingDB:
Activity Spreadsheet -- Enzyme Inhibition Constant Data from BindingDB
Found 2 hits for monomerid = 50066767
TargetSerine protease 1(Bos taurus (bovine))
Novartis Pharma
Curated by ChEMBL
LigandPNGBDBM50066767((3R,6R,8aS)-6-Amino-5-oxo-hexahydro-thiazolo[3,2-a...)
Affinity DataKi:  5.36E+3nM. Assay description: Invitro inhibition was measured against Human bovine pancreatic trypsin.
In DepthDetails ArticlePubMed
TargetProthrombin(Homo sapiens (Human))
Novartis Pharma
Curated by ChEMBL
LigandPNGBDBM50066767((3R,6R,8aS)-6-Amino-5-oxo-hexahydro-thiazolo[3,2-a...)
Affinity DataKi:  6.24E+4nM. Assay description: Invitro inhibition was measured against Human Thrombin.
In DepthDetails ArticlePubMed