BDBM50067060 CHEMBL128523::Sodium; (1S,5R)-2-tert-butoxycarbonyl-7-oxo-2,6-diaza-bicyclo[3.2.0]heptane-6-sulfonate
SMILES CC(C)(C)OC(=O)N1CC[C@@H]2[C@H]1C(=O)N2S([O-])(=O)=O
InChI Key InChIKey=FBCNAOZPYXZOOX-RQJHMYQMSA-M
Data  2 IC50  2 Koff  2 Kon
  Tab Delimited (TSV)   2D SDfile   Computed 3D by Vconf -m prep SDfile
Find this compound or compounds like it in BindingDB:
Activity Spreadsheet -- Enzyme Inhibition Constant Data from BindingDB
Found 5 hits for monomerid = 50067060
TargetBeta-lactamase(Pseudomonas aeruginosa (PAO1))
F. Hoffmann-La Roche
Curated by ChEMBL
LigandPNGBDBM50067060(CHEMBL128523 | Sodium; (1S,5R)-2-tert-butoxycarbon...)
Affinity DataKon:  0.0000370M-1s-1 Koff:  11s-1Assay Description:Deacylation of 18SH Beta-lactamase of Pseudomonas aeruginosa
In DepthDetails ArticlePubMed
TargetBeta-lactamase(Escherichia coli)
F. Hoffmann-La Roche
Curated by ChEMBL
LigandPNGBDBM50067060(CHEMBL128523 | Sodium; (1S,5R)-2-tert-butoxycarbon...)
Affinity DataIC50: >1.00E+5nM. Assay description: Inhibitory activity against Escherichia coli TEM-3 Beta-lactamase
In DepthDetails ArticlePubMed
TargetBeta-lactamase(Pseudomonas aeruginosa (PAO1))
F. Hoffmann-La Roche
Curated by ChEMBL
LigandPNGBDBM50067060(CHEMBL128523 | Sodium; (1S,5R)-2-tert-butoxycarbon...)
Affinity DataKon:  0.0000370M-1s-1Assay Description:Deacylation of 18SH Beta-lactamase of Pseudomonas aeruginosa
In DepthDetails ArticlePubMed
TargetBeta-lactamase(Pseudomonas aeruginosa (PAO1))
F. Hoffmann-La Roche
Curated by ChEMBL
LigandPNGBDBM50067060(CHEMBL128523 | Sodium; (1S,5R)-2-tert-butoxycarbon...)
Affinity DataKoff:  11s-1Assay Description:Acylation of Pseudomonas aeruginosa 18SH Beta-lactamase
In DepthDetails ArticlePubMed
TargetBeta-lactamase(Pseudomonas aeruginosa (PAO1))
F. Hoffmann-La Roche
Curated by ChEMBL
LigandPNGBDBM50067060(CHEMBL128523 | Sodium; (1S,5R)-2-tert-butoxycarbon...)
Affinity DataIC50:  15nM. Assay description: Inhibition of P. aeruginosa 18SH Beta-lactamase.
In DepthDetails ArticlePubMed