BDBM50067214 CHEMBL3400597
SMILES Cl.Clc1ccccc1N1CCN(CCCCN2CCCC2=O)CC1
InChI Key InChIKey=RFFLBWRKQXJYFL-UHFFFAOYSA-N
Data  2 EC50
  Tab Delimited (TSV)   2D SDfile   Computed 3D by Vconf -m prep SDfile
Find this compound or compounds like it in BindingDB:
Activity Spreadsheet -- Enzyme Inhibition Constant Data from BindingDB
Found 2 hits for monomerid = 50067214
TargetAlpha-1B adrenergic receptor(Homo sapiens (Human))
Jagiellonian University Medical College
Curated by ChEMBL
LigandPNGBDBM50067214(CHEMBL3400597)
Affinity DataEC50:  2.5nM. Assay description: Antagonist activity at alpha-1B adrenergic receptor (unknown origin) incubated for 30 mins prior to agonist addition measured after 5 hrs by CCF4-AM ...
In DepthDetails ArticlePubMed
TargetAlpha-1A adrenergic receptor(Homo sapiens (Human))
Jagiellonian University Medical College
Curated by ChEMBL
LigandPNGBDBM50067214(CHEMBL3400597)
Affinity DataEC50:  138nM. Assay description: Antagonist activity at alpha-1A adrenergic receptor (unknown origin) incubated for 30 mins prior to agonist addition measured after 5 hrs by CCF4-AM ...
In DepthDetails ArticlePubMed