BDBM50067217 CHEMBL323649::{(S)-6-[4-(Imino-morpholin-4-yl-methyl)-benzoylamino]-chroman-3-yl}-acetic acid::{6-[4-(Imino-morpholin-4-yl-methyl)-benzoylamino]-chroman-3-yl}-acetic acid(MS-180)
SMILES OC(=O)C[C@H]1COc2ccc(NC(=O)c3ccc(cc3)C(=N)N3CCOCC3)cc2C1
InChI Key InChIKey=LOLMVTRGQZKBHS-HNNXBMFYSA-N
Data  2 IC50
  Tab Delimited (TSV)   2D SDfile   Computed 3D by Vconf -m prep SDfile
Find this compound or compounds like it in BindingDB:
Activity Spreadsheet -- Enzyme Inhibition Constant Data from BindingDB
Found 2 hits for monomerid = 50067217
TargetIntegrin alpha-IIb/beta-3(Homo sapiens (Human))
Cor Therapeutics
Curated by ChEMBL
LigandPNGBDBM50067217(CHEMBL323649 | {(S)-6-[4-(Imino-morpholin-4-yl-met...)
Affinity DataIC50:  35nM. Assay description: In vitro inhibition of gel filtered platelet aggregation induced by ADP.
In DepthDetails ArticlePubMed
TargetIntegrin alpha-IIb/beta-3(Homo sapiens (Human))
Cor Therapeutics
Curated by ChEMBL
LigandPNGBDBM50067217(CHEMBL323649 | {(S)-6-[4-(Imino-morpholin-4-yl-met...)
Affinity DataIC50:  0.120nM. Assay description: Inhibition of Fibronogen binding to Immobilized Human Fibrinogen Receptor.
In DepthDetails ArticlePubMed