BDBM50067221 CHEMBL3400596
SMILES Cl.Fc1ccc(N2CCN(CCCCN3CCCC3=O)CC2)c(F)c1
InChI Key InChIKey=PILPOLVYZWONLU-UHFFFAOYSA-N
Data  1 EC50
  Tab Delimited (TSV)   2D SDfile   Computed 3D by Vconf -m prep SDfile
Find this compound or compounds like it in BindingDB:
Activity Spreadsheet -- Enzyme Inhibition Constant Data from BindingDB
Found 1 hit for monomerid = 50067221
TargetAlpha-1B adrenergic receptor(Homo sapiens (Human))
Jagiellonian University Medical College
Curated by ChEMBL
LigandPNGBDBM50067221(CHEMBL3400596)
Affinity DataEC50:  47nM. Assay description: Antagonist activity at alpha-1B adrenergic receptor (unknown origin) incubated for 30 mins prior to agonist addition measured after 5 hrs by CCF4-AM ...
In DepthDetails ArticlePubMed