BDBM50067222 CHEMBL128906::[6-(4-Carbamimidoyl-benzoylamino)-chroman-3-yl]-acetic acid
SMILES NC(=N)c1ccc(cc1)C(=O)Nc1ccc2OCC(CC(O)=O)Cc2c1
InChI Key InChIKey=FFYHCEWZIRARDA-UHFFFAOYSA-N
Data  1 IC50
  Tab Delimited (TSV)   2D SDfile   Computed 3D by Vconf -m prep SDfile
Find this compound or compounds like it in BindingDB:
Activity Spreadsheet -- Enzyme Inhibition Constant Data from BindingDB
Found 1 hit for monomerid = 50067222
TargetIntegrin alpha-IIb/beta-3(Homo sapiens (Human))
Mitsui Pharmaceuticals
Curated by ChEMBL
LigandPNGBDBM50067222(CHEMBL128906 | [6-(4-Carbamimidoyl-benzoylamino)-c...)
Affinity DataIC50:  0.0730nM. Assay description: Inhibition of Fibronogen binding to Immobilized Human Fibrinogen Receptor.
In DepthDetails ArticlePubMed