BDBM50067407 (3R)-2'-(4-bromo-2-fluorobenzyl)-1'H,2H,5H-spiro[pyrrolidine-3,4'-pyrrolo[1,2-a]pyrazine]-1',2,3',5(2'H)-tetrone::CHEMBL334830
SMILES Fc1cc(Br)ccc1CN1C(=O)c2cccn2[C@@]2(CC(=O)NC2=O)C1=O
InChI Key InChIKey=QCVNMNYRNIMDKV-QGZVFWFLSA-N
Data  2 IC50
  Tab Delimited (TSV)   2D SDfile   Computed 3D by Vconf -m prep SDfile
Find this compound or compounds like it in BindingDB:
Activity Spreadsheet -- Enzyme Inhibition Constant Data from BindingDB
Found 2 hits for monomerid = 50067407
TargetAldo-keto reductase family 1 member B1(Homo sapiens (Human))
Università
Curated by ChEMBL
LigandPNGBDBM50067407((3R)-2'-(4-bromo-2-fluorobenzyl)-1'H,2H,5H-spiro[p...)
Affinity DataIC50:  15nM. Assay description: Inhibition of aldose reductase
In DepthDetails ArticlePubMed
TargetAldo-keto reductase family 1 member B1(Sus scrofa)
Dainippon Pharmaceutical
Curated by ChEMBL
LigandPNGBDBM50067407((3R)-2'-(4-bromo-2-fluorobenzyl)-1'H,2H,5H-spiro[p...)
Affinity DataIC50:  15nM. Assay description: In vitro inhibitory activity against aldose reductase in porcine lens.
In DepthDetails ArticlePubMed