BDBM50067681 5-[1-(3-Chloro-phenyl)-meth-(Z)-ylidene]-2,2,4-trimethyl-2,5-dihydro-1H-6-oxa-1-aza-chrysene::CHEMBL337262
SMILES CC1=CC(C)(C)Nc2ccc3-c4ccccc4O\C(=C/c4cccc(Cl)c4)c3c12
InChI Key InChIKey=SKBNHDTXAHIITG-UCQKPKSFSA-N
Data  1 KI  1 EC50
  Tab Delimited (TSV)   2D SDfile   Computed 3D by Vconf -m prep SDfile
Find this compound or compounds like it in BindingDB:
Activity Spreadsheet -- Enzyme Inhibition Constant Data from BindingDB
Found 2 hits for monomerid = 50067681
TargetProgesterone receptor(Homo sapiens (Human))
Ligand Pharmaceuticals
Curated by ChEMBL
LigandPNGBDBM50067681(5-[1-(3-Chloro-phenyl)-meth-(Z)-ylidene]-2,2,4-tri...)
Affinity DataKi:  18.7nM. Assay description: Binding affinity against human progesterone receptor
In DepthDetails ArticlePubMed
TargetProgesterone receptor(Homo sapiens (Human))
Ligand Pharmaceuticals
Curated by ChEMBL
LigandPNGBDBM50067681(5-[1-(3-Chloro-phenyl)-meth-(Z)-ylidene]-2,2,4-tri...)
Affinity DataEC50:  117nM. Assay description: Effective concentration (EC50) against human progesterone receptor expressed in CV-1 cell
In DepthDetails ArticlePubMed