BDBM50068098 CHEMBL3402229
SMILES C[C@H]1[C@H](O)CCN1c1ccc(C#N)c2ccccc12
InChI Key InChIKey=LWQKZNNGOSPTCG-MEDUHNTESA-N
Data  1 IC50  1 EC50
  Tab Delimited (TSV)   2D SDfile   Computed 3D by Vconf -m prep SDfile
Find this compound or compounds like it in BindingDB:
Activity Spreadsheet -- Enzyme Inhibition Constant Data from BindingDB
Found 2 hits for monomerid = 50068098
TargetAndrogen receptor(Homo sapiens (Human))
Takeda Pharmaceutical
Curated by ChEMBL
LigandPNGBDBM50068098(CHEMBL3402229)
Affinity DataEC50:  0.320nM. Assay description: Modulation of androgen receptor (unknown origin) expressed in Cos7 cells assessed as luciferase activity after 24 hrs
In DepthDetails ArticlePubMed
TargetAndrogen receptor(Homo sapiens (Human))
Takeda Pharmaceutical
Curated by ChEMBL
LigandPNGBDBM50068098(CHEMBL3402229)
Affinity DataIC50:  2.40nM. Assay description: Displacement of [3H]mibolerone from androgen receptor (unknown origin) after 3 hrs
In DepthDetails ArticlePubMed