BDBM50068369 3-Methoxy-N-[2-(4-pyridin-2-yl-piperazin-1-yl)-ethyl]-benzamide::CHEMBL147483
SMILES COc1cccc(c1)C(=O)NCCN1CCN(CC1)c1ccccn1
InChI Key InChIKey=RMGWJLOIEDIFJI-UHFFFAOYSA-N
Data  4 KI  3 IC50
  Tab Delimited (TSV)   2D SDfile   Computed 3D by Vconf -m prep SDfile
Find this compound or compounds like it in BindingDB:
Activity Spreadsheet -- Enzyme Inhibition Constant Data from BindingDB
Found 7 hits for monomerid = 50068369
TargetD(4) dopamine receptor(Homo sapiens (Human))
Universit£
Curated by ChEMBL
LigandPNGBDBM50068369(3-Methoxy-N-[2-(4-pyridin-2-yl-piperazin-1-yl)-eth...)
Affinity DataKi:  0.630nM. Assay description: Binding affinity towards human Dopamine receptor D4 using [3H]spiroperidol as radioligand
In DepthDetails ArticlePubMed
Target5-hydroxytryptamine receptor 1A(Rattus norvegicus (rat))
Universit£
Curated by ChEMBL
LigandPNGBDBM50068369(3-Methoxy-N-[2-(4-pyridin-2-yl-piperazin-1-yl)-eth...)
Affinity DataKi:  27nM. Assay description: Binding affinity towards 5-hydroxytryptamine 1A receptor from rat hippocampal membranes
In DepthDetails ArticlePubMed
TargetD(3) dopamine receptor(Rattus norvegicus (Rat))
Universit£
Curated by ChEMBL
LigandPNGBDBM50068369(3-Methoxy-N-[2-(4-pyridin-2-yl-piperazin-1-yl)-eth...)
Affinity DataKi: >850nM. Assay description: Binding affinity towards Dopamine receptor D3 of rat using [3H]spiroperidol as radioligand
In DepthDetails ArticlePubMed
TargetD(2) dopamine receptor(Homo sapiens (Human))
Universit£
Curated by ChEMBL
LigandPNGBDBM50068369(3-Methoxy-N-[2-(4-pyridin-2-yl-piperazin-1-yl)-eth...)
Affinity DataKi: >1.00E+3nM. Assay description: Binding affinity towards human dopamine receptor D2 using [3H]spiroperidol as radioligand
In DepthDetails ArticlePubMed
TargetD(2) dopamine receptor(Homo sapiens (Human))
Universit£
Curated by ChEMBL
LigandPNGBDBM50068369(3-Methoxy-N-[2-(4-pyridin-2-yl-piperazin-1-yl)-eth...)
Affinity DataIC50: >1.00E+3nM. Assay description: In vitro binding affinity at human cloned Dopamine receptor D2 by [3H]-spiroperidol displacement.
In DepthDetails ArticlePubMed
TargetD(4) dopamine receptor(Homo sapiens (Human))
Universit£
Curated by ChEMBL
LigandPNGBDBM50068369(3-Methoxy-N-[2-(4-pyridin-2-yl-piperazin-1-yl)-eth...)
Affinity DataIC50:  1nM. Assay description: In vitro binding affinity at human cloned Dopamine receptor D4.2 by [3H]-YM-09151-2 displacement.
In DepthDetails ArticlePubMed
Target5-hydroxytryptamine receptor 1A(Rattus norvegicus (rat))
Universit£
Curated by ChEMBL
LigandPNGBDBM50068369(3-Methoxy-N-[2-(4-pyridin-2-yl-piperazin-1-yl)-eth...)
Affinity DataIC50:  30nM. Assay description: Binding affinity was measured at the serotonin 5-hydroxytryptamine 1A receptor using [3H]-8-OH-DPAT as radioligand in rat hippocampal membrane.
In DepthDetails ArticlePubMed