BDBM50068738 4'-Isobutyl-2'-isopropylamino-biphenyl-2-sulfonic acid (3,4-dimethyl-isoxazol-5-yl)-amide::CHEMBL151422
SMILES CC(C)Cc1ccc(c(NC(C)C)c1)-c1ccccc1S(=O)(=O)Nc1onc(C)c1C
InChI Key InChIKey=QQJYYSGSVAWMIH-UHFFFAOYSA-N
Data  2 KI
  Tab Delimited (TSV)   2D SDfile   Computed 3D by Vconf -m prep SDfile
Find this compound or compounds like it in BindingDB:
Activity Spreadsheet -- Enzyme Inhibition Constant Data from BindingDB
Found 2 hits for monomerid = 50068738
TargetEndothelin-1 receptor(RAT)
Bristol-Myers Squibb Pharmaceutical Research Institute
Curated by ChEMBL
LigandPNGBDBM50068738(4'-Isobutyl-2'-isopropylamino-biphenyl-2-sulfonic ...)
Affinity DataKi:  34nM. Assay description: Ability to inhibit binding of [125I]ET1 to membranes prepared from A10 rat thoracic aorta smooth muscle Endothelin A receptor
In DepthDetails ArticlePubMed
TargetEndothelin receptor type B(RAT)
Bristol-Myers Squibb Pharmaceutical Research Institute
Curated by ChEMBL
LigandPNGBDBM50068738(4'-Isobutyl-2'-isopropylamino-biphenyl-2-sulfonic ...)
Affinity DataKi:  2.90E+3nM. Assay description: Ability to inhibit binding of [125I]-ET-1 to membranes prepared from A10 rat cerebellum (Endothelin B receptor)
In DepthDetails ArticlePubMed