BDBM50068888 CHEMBL170074::{(S)-1-[(S)-2-(1-Benzyl-3-benzylcarbamoyl-3,3-difluoro-2-oxo-propylcarbamoyl)-pyrrolidine-1-carbonyl]-2-methyl-propyl}-carbamic acid tert-butyl ester
SMILES CC(C)[C@H](NC(=O)OC(C)(C)C)C(=O)N1CCC[C@H]1C(=O)NC(Cc1ccccc1)C(=O)C(F)(F)C(=O)NCc1ccccc1
InChI Key InChIKey=TYHMRABMDQBPNX-WIXBZOCESA-N
Data  4 KI
  Tab Delimited (TSV)   2D SDfile   Computed 3D by Vconf -m prep SDfile
Find this compound or compounds like it in BindingDB:
Activity Spreadsheet -- Enzyme Inhibition Constant Data from BindingDB
Found 4 hits for monomerid = 50068888
TargetChymase(Homo sapiens (Human))
Green Cross Research Laboratories
Curated by ChEMBL
LigandPNGBDBM50068888(CHEMBL170074 | {(S)-1-[(S)-2-(1-Benzyl-3-benzylcar...)
Affinity DataKi:  92nM. Assay description: Compound was evaluated for inhibitory activity against human heart chymase (HHC)
In DepthDetails ArticlePubMed
TargetChymase(Homo sapiens (Human))
Green Cross Research Laboratories
Curated by ChEMBL
LigandPNGBDBM50068888(CHEMBL170074 | {(S)-1-[(S)-2-(1-Benzyl-3-benzylcar...)
Affinity DataKi:  92.4nM. Assay description: Compound was evaluated for inhibitory activity against Chymotrypsinogen
In DepthDetails ArticlePubMed
TargetChymotrypsinogen A(Bos taurus (bovine))
Green Cross Research Laboratories
Curated by ChEMBL
LigandPNGBDBM50068888(CHEMBL170074 | {(S)-1-[(S)-2-(1-Benzyl-3-benzylcar...)
Affinity DataKi:  1.19E+4nM. Assay description: Compound was evaluated for inhibitory activity against human heart chymase (HHC)
In DepthDetails ArticlePubMed
TargetChymotrypsinogen A(Bos taurus (bovine))
Green Cross Research Laboratories
Curated by ChEMBL
LigandPNGBDBM50068888(CHEMBL170074 | {(S)-1-[(S)-2-(1-Benzyl-3-benzylcar...)
Affinity DataKi:  1.19E+4nM. Assay description: Compound was evaluated for inhibitory activity against Chymotrypsinogen
In DepthDetails ArticlePubMed