BDBM50068981 CHEMBL3403480
SMILES CCOc1cc(OC(C)C)c(F)c(c1)C(Nc1ccc(cc1)C(N)=N)c1nc(c[nH]1)-c1ccccc1C(=O)NC
InChI Key InChIKey=LMQZDDQSYCTDFJ-UHFFFAOYSA-N
Data  1 KI
  Tab Delimited (TSV)   2D SDfile   Computed 3D by Vconf -m prep SDfile
Find this compound or compounds like it in BindingDB:
Activity Spreadsheet -- Enzyme Inhibition Constant Data from BindingDB
Found 1 hit for monomerid = 50068981
TargetCoagulation factor VII(Homo sapiens (Human))
Bristol-Myers Squibb R & D
Curated by ChEMBL
LigandPNGBDBM50068981(CHEMBL3403480)
Affinity DataKi:  68nM. Assay description: Inhibition of human factor 7a using H-D-Ile-Pro-Arg-pNA substrate
In DepthDetails ArticlePubMed