BDBM50068992 CHEMBL3403471
SMILES CCOc1cc(OC(C)C)c(F)c(c1)C(Nc1ccc(cc1)C(N)=N)c1nc(c[nH]1)-c1ccccc1C
InChI Key InChIKey=PJNZMRYWHMYPCK-UHFFFAOYSA-N
Data  4 KI
  Tab Delimited (TSV)   2D SDfile   Computed 3D by Vconf -m prep SDfile
Find this compound or compounds like it in BindingDB:
Activity Spreadsheet -- Enzyme Inhibition Constant Data from BindingDB
Found 4 hits for monomerid = 50068992
TargetCoagulation factor VII(Homo sapiens (Human))
Bristol-Myers Squibb R & D
Curated by ChEMBL
LigandPNGBDBM50068992(CHEMBL3403471)
Affinity DataKi:  19nM. Assay description: Inhibition of human factor 7a using H-D-Ile-Pro-Arg-pNA substrate
In DepthDetails ArticlePubMed
TargetTrypsin(Homo sapiens (Human))
Bristol-Myers Squibb R & D
Curated by ChEMBL
LigandPNGBDBM50068992(CHEMBL3403471)
Affinity DataKi:  400nM. Assay description: Inhibition of trypsin (unknown origin)
In DepthDetails ArticlePubMed
TargetCoagulation factor X(Homo sapiens (Human))
Bristol-Myers Squibb R & D
Curated by ChEMBL
LigandPNGBDBM50068992(CHEMBL3403471)
Affinity DataKi:  680nM. Assay description: Inhibition of factor 10a (unknown origin)
In DepthDetails ArticlePubMed
TargetProthrombin(Homo sapiens (Human))
Bristol-Myers Squibb R & D
Curated by ChEMBL
LigandPNGBDBM50068992(CHEMBL3403471)
Affinity DataKi:  710nM. Assay description: Inhibition of factor 2a (unknown origin)
In DepthDetails ArticlePubMed