BDBM50068993 CHEMBL3403470
SMILES CCOc1cc(OC(C)C)c(F)c(c1)C(Nc1ccc(cc1)C(N)=N)c1nc(co1)-c1ccccc1
InChI Key InChIKey=RLILJHQOLYXXTQ-UHFFFAOYSA-N
Data  1 KI
  Tab Delimited (TSV)   2D SDfile   Computed 3D by Vconf -m prep SDfile
Find this compound or compounds like it in BindingDB:
Activity Spreadsheet -- Enzyme Inhibition Constant Data from BindingDB
Found 1 hit for monomerid = 50068993
TargetCoagulation factor VII(Homo sapiens (Human))
Bristol-Myers Squibb R & D
Curated by ChEMBL
LigandPNGBDBM50068993(CHEMBL3403470)
Affinity DataKi:  20nM. Assay description: Inhibition of human factor 7a using H-D-Ile-Pro-Arg-pNA substrate
In DepthDetails ArticlePubMed