BDBM50069063 CHEMBL3403459
SMILES CCOc1cc(OC(C)C)c(F)c(c1)C(Nc1ccc(cc1)C(N)=N)c1ccccn1
InChI Key InChIKey=MYJXUMMMKWLTDS-UHFFFAOYSA-N
Data  1 KI
  Tab Delimited (TSV)   2D SDfile   Computed 3D by Vconf -m prep SDfile
Find this compound or compounds like it in BindingDB:
Activity Spreadsheet -- Enzyme Inhibition Constant Data from BindingDB
Found 1 hit for monomerid = 50069063
TargetCoagulation factor VII(Homo sapiens (Human))
Bristol-Myers Squibb R & D
Curated by ChEMBL
LigandPNGBDBM50069063(CHEMBL3403459)
Affinity DataKi:  750nM. Assay description: Inhibition of human factor 7a using H-D-Ile-Pro-Arg-pNA substrate
In DepthDetails ArticlePubMed