BDBM50069221 (2R,3R)-N*4*-((S)-2,2-Dimethyl-1-methylcarbamoyl-propyl)-2,N*1*-dihydroxy-2-methyl-3-(3-phenyl-propyl)-succinamide::CHEMBL169084
SMILES CNC(=O)[C@@H](NC(=O)[C@H](CCCc1ccccc1)[C@@](C)(O)C(=O)NO)C(C)(C)C
InChI Key InChIKey=RCJJPUINEATAJF-GCKMJXCFSA-N
Data  3 KI
  Tab Delimited (TSV)   2D SDfile   Computed 3D by Vconf -m prep SDfile
Find this compound or compounds like it in BindingDB:
Activity Spreadsheet -- Enzyme Inhibition Constant Data from BindingDB
Found 3 hits for monomerid = 50069221
TargetMatrix metalloproteinase-9(Homo sapiens (Human))
Dupont Pharmaceuticals
Curated by ChEMBL
LigandPNGBDBM50069221((2R,3R)-N*4*-((S)-2,2-Dimethyl-1-methylcarbamoyl-p...)
Affinity DataKi: <1nM. Assay description: Binding affinity was evaluated against matrix metalloprotease-9
In DepthDetails ArticlePubMed
TargetStromelysin-1(Homo sapiens (Human))
Dupont Pharmaceuticals
Curated by ChEMBL
LigandPNGBDBM50069221((2R,3R)-N*4*-((S)-2,2-Dimethyl-1-methylcarbamoyl-p...)
Affinity DataKi:  13nM. Assay description: Binding affinity against human matrix metalloproteinase-3.
In DepthDetails ArticlePubMed
TargetInterstitial collagenase(Homo sapiens (Human))
Dupont Pharmaceuticals
Curated by ChEMBL
LigandPNGBDBM50069221((2R,3R)-N*4*-((S)-2,2-Dimethyl-1-methylcarbamoyl-p...)
Affinity DataKi:  13nM. Assay description: Binding affinity was evaluated against matrix metalloproteinase-1
In DepthDetails ArticlePubMed