BDBM50069456 1-Methyl-1H-pyrrole-2-carboxylic acid (7-bromo-2,3-dioxo-1,2,3,4-tetrahydro-quinoxalin-5-ylmethyl)-amide::CHEMBL434644
SMILES Cn1cccc1C(=O)NCc1cc(Br)cc2[nH]c(=O)c(=O)[nH]c12
InChI Key InChIKey=VLQYYHZLTPAQRH-UHFFFAOYSA-N
Data  1 IC50
  Tab Delimited (TSV)   2D SDfile   Computed 3D by Vconf -m prep SDfile
Find this compound or compounds like it in BindingDB:
Activity Spreadsheet -- Enzyme Inhibition Constant Data from BindingDB
Found 1 hit for monomerid = 50069456
TargetGlutamate receptor ionotropic, NMDA 1(RAT)
Novartis Pharma
Curated by ChEMBL
LigandPNGBDBM50069456(1-Methyl-1H-pyrrole-2-carboxylic acid (7-bromo-2,3...)
Affinity DataIC50:  20nM. Assay description: In vitro binding assay for the displacement of [3H]MDL-105519 from the glycine-site of NMDA receptors
In DepthDetails ArticlePubMed