BDBM50069461 CHEMBL357447::N-(7-Bromo-2,3-dioxo-1,2,3,4-tetrahydro-quinoxalin-5-ylmethyl)-2-(2-nitro-phenyl)-acetamide
SMILES [O-][N+](=O)c1ccccc1CC(=O)NCc1cc(Br)cc2[n-]c(=[OH+])c(=O)[nH]c12
InChI Key InChIKey=SICNHTKDWCUQJZ-UHFFFAOYSA-N
Data  1 IC50
  Tab Delimited (TSV)   2D SDfile   Computed 3D by Vconf -m prep SDfile
Find this compound or compounds like it in BindingDB:
Activity Spreadsheet -- Enzyme Inhibition Constant Data from BindingDB
Found 1 hit for monomerid = 50069461
TargetGlutamate receptor ionotropic, NMDA 1(RAT)
Novartis Pharma
Curated by ChEMBL
LigandPNGBDBM50069461(CHEMBL357447 | N-(7-Bromo-2,3-dioxo-1,2,3,4-tetrah...)
Affinity DataIC50:  20nM. Assay description: In vitro binding assay for the displacement of [3H]MDL-105519 from the glycine-site of NMDA receptors
In DepthDetails ArticlePubMed