BDBM50069753 CHEMBL3407538
SMILES [H][C@@]12CC[C@H](O)[C@@]1(C)CC[C@@]1([H])[C@@]2([H])CC(=C)C2=CC(=O)C=C[C@]12C
InChI Key InChIKey=NFDPYPMRHKQTDM-NHWXPXPKSA-N
Data  2 IC50
  Tab Delimited (TSV)   2D SDfile   Computed 3D by Vconf -m prep SDfile
Find this compound or compounds like it in BindingDB:
Activity Spreadsheet -- Enzyme Inhibition Constant Data from BindingDB
Found 2 hits for monomerid = 50069753
TargetAromatase(Homo sapiens (Human))
University Of Coimbra
Curated by ChEMBL
LigandPNGBDBM50069753(CHEMBL3407538)
Affinity DataIC50:  100nM. Assay description: Inhibition of human placental microsome aromatase using [1beta-3H] androstenedione as substrate after 15 mins by liquid scintillation counting
In DepthDetails ArticlePubMed
TargetAromatase(Homo sapiens (Human))
University Of Coimbra
Curated by ChEMBL
LigandPNGBDBM50069753(CHEMBL3407538)
Affinity DataIC50:  250nM. Assay description: Inhibition of human placental microsome aromatase expressed in human MCF7 cells using [1beta-3H] androstenedione as substrate after 1 hr by liquid sc...
In DepthDetails ArticlePubMed