BDBM50069754 CHEMBL3407537
SMILES [H][C@@]12O[C@]1([H])[C@@]1(C)C(=CC2=O)C(=C)C[C@@]2([H])[C@]3([H])CCC(=O)[C@@]3(C)CC[C@]12[H]
InChI Key InChIKey=ACZFVFMOZUAEEW-XXWSGHEVSA-N
Data  2 IC50
  Tab Delimited (TSV)   2D SDfile   Computed 3D by Vconf -m prep SDfile
Find this compound or compounds like it in BindingDB:
Activity Spreadsheet -- Enzyme Inhibition Constant Data from BindingDB
Found 2 hits for monomerid = 50069754
TargetAromatase(Homo sapiens (Human))
University Of Coimbra
Curated by ChEMBL
LigandPNGBDBM50069754(CHEMBL3407537)
Affinity DataIC50:  810nM. Assay description: Inhibition of human placental microsome aromatase using [1beta-3H] androstenedione as substrate after 15 mins by liquid scintillation counting
In DepthDetails ArticlePubMed
TargetAromatase(Homo sapiens (Human))
University Of Coimbra
Curated by ChEMBL
LigandPNGBDBM50069754(CHEMBL3407537)
Affinity DataIC50:  1.18E+3nM. Assay description: Inhibition of human placental microsome aromatase expressed in human MCF7 cells using [1beta-3H] androstenedione as substrate after 1 hr by liquid sc...
In DepthDetails ArticlePubMed