BDBM50069992 CHEMBL3407766
SMILES [H][C@]12C[C@]1([C@@H](O)[C@@H](O)[C@@H]2n1cnc2c(NC)nc(nc12)C#Cc1ccccc1OC)C(=O)NC
InChI Key InChIKey=MTXXZWXHVQXLMU-VYYPKGNMSA-N
Data  1 KI
  Tab Delimited (TSV)   2D SDfile   Computed 3D by Vconf -m prep SDfile
Find this compound or compounds like it in BindingDB:
Activity Spreadsheet -- Enzyme Inhibition Constant Data from BindingDB
Found 1 hit for monomerid = 50069992
TargetAdenosine receptor A3(Homo sapiens (Human))
National Institute Of Diabetes And Digestive And Kidney Diseases
Curated by ChEMBL
LigandPNGBDBM50069992(CHEMBL3407766)
Affinity DataKi:  0.770nM. Assay description: Displacement of [125I]I-AB-MECA from human recombinant A3 adenosine receptor expressed in CHO cells after 60 mins by liquid scintillation counting
In DepthDetails ArticlePubMed