BDBM50069996 CHEMBL3407772
SMILES [H][C@]12C[C@]1([C@@H](O)[C@@H](O)[C@@H]2n1cnc2c(NC)nc(nc12)C#Cc1ccncc1)C(=O)NC
InChI Key InChIKey=UBJMWPIMVXXGBX-MXKWNSRKSA-N
Data  1 KI
  Tab Delimited (TSV)   2D SDfile   Computed 3D by Vconf -m prep SDfile
Find this compound or compounds like it in BindingDB:
Activity Spreadsheet -- Enzyme Inhibition Constant Data from BindingDB
Found 1 hit for monomerid = 50069996
TargetAdenosine receptor A3(Homo sapiens (Human))
National Institute Of Diabetes And Digestive And Kidney Diseases
Curated by ChEMBL
LigandPNGBDBM50069996(CHEMBL3407772)
Affinity DataKi:  2.10nM. Assay description: Displacement of [125I]I-AB-MECA from human recombinant A3 adenosine receptor expressed in CHO cells after 60 mins by liquid scintillation counting
In DepthDetails ArticlePubMed