BDBM50070718 CHEMBL98759
SMILES CN1CCC=C(C1)c1nsnc1SCCc1ccccc1
InChI Key InChIKey=GXSFDCINBOQYAD-LDJGGQOZSA-N
Data  1 IC50
  Tab Delimited (TSV)   2D SDfile   Computed 3D by Vconf -m prep SDfile
Find this compound or compounds like it in BindingDB:
Activity Spreadsheet -- Enzyme Inhibition Constant Data from BindingDB
Found 1 hit for monomerid = 50070718
LigandPNGBDBM50070718(CHEMBL98759)
Affinity DataIC50:  23nM. Assay description: Binding affinity against muscarinic receptor in rat brain membranes using oxotremorine-M as ligand
In DepthDetails ArticlePubMed