BDBM50071100 CHEMBL3410008
SMILES Cc1c(NC(=O)c2cccs2)cc(cc1S(=O)(=O)NC1CCCC1)-c1csc(=O)[nH]1
InChI Key InChIKey=NWFQYVATODQHCT-UHFFFAOYSA-N
Data  1 IC50
  Tab Delimited (TSV)   2D SDfile   Computed 3D by Vconf -m prep SDfile
Find this compound or compounds like it in BindingDB:
Activity Spreadsheet -- Enzyme Inhibition Constant Data from BindingDB
Found 1 hit for monomerid = 50071100
TargetBromodomain-containing protein 4(Homo sapiens (Human))
Shanghai Institute Of Materia Medica
Curated by ChEMBL
LigandPNGBDBM50071100(CHEMBL3410008)
Affinity DataIC50:  790nM. Assay description: Inhibition of BRD4(1) (unknown origin) incubated for 4 hrs by (+)-JQ1 fluorescent ligand based fluorescence anisotrophy
In DepthDetails ArticlePubMed