BDBM50071201 (R)-2-[(R)-2-(2-{(R)-2-[(R)-2-Amino-3-(4-hydroxy-phenyl)-propionylamino]-3-hydroxy-2-methyl-propionylamino}-acetylamino)-3-phenyl-propionylamino]-4-methyl-pentanoic acid::CHEMBL60936
SMILES CC(C)C[C@@H](NC(=O)[C@@H](Cc1ccccc1)NC(=O)CNC(=O)[C@@](C)(CO)NC(=O)[C@H](N)Cc1ccc(O)cc1)C(O)=O
InChI Key InChIKey=YQDDALASDIGIHO-NULUGNBJSA-N
Data  4 IC50
  Tab Delimited (TSV)   2D SDfile   Computed 3D by Vconf -m prep SDfile
Find this compound or compounds like it in BindingDB:
Activity Spreadsheet -- Enzyme Inhibition Constant Data from BindingDB
Found 4 hits for monomerid = 50071201
TargetDelta-type opioid receptor(Rattus norvegicus (rat))
Institute For Bioorganic Research
Curated by ChEMBL
LigandPNGBDBM50071201((R)-2-[(R)-2-(2-{(R)-2-[(R)-2-Amino-3-(4-hydroxy-p...)
Affinity DataIC50:  0.0710nM. Assay description: Inhibitory activity against forskolin-stimulated cAMP production in chinese hamster ovary cells expressing Opioid receptor delta 1
In DepthDetails ArticlePubMed
TargetDelta-type opioid receptor(Rattus norvegicus (rat))
Institute For Bioorganic Research
Curated by ChEMBL
LigandPNGBDBM50071201((R)-2-[(R)-2-(2-{(R)-2-[(R)-2-Amino-3-(4-hydroxy-p...)
Affinity DataIC50:  0.400nM. Assay description: Binding affinity against rat Opioid receptor delta 1 expressed in CHO cells determined by competitive inhibition of 1 nM [3H]DPDPE.
In DepthDetails ArticlePubMed
TargetKappa-type opioid receptor(Rattus norvegicus (rat))
Institute For Bioorganic Research
Curated by ChEMBL
LigandPNGBDBM50071201((R)-2-[(R)-2-(2-{(R)-2-[(R)-2-Amino-3-(4-hydroxy-p...)
Affinity DataIC50: >1.00E+4nM. Assay description: Binding affinity against rat kappa-opioid receptor expressed in CHO cells was determined by competitive inhibition of 2 nM [3H]-U 69593
In DepthDetails ArticlePubMed
TargetMu-type opioid receptor(Rattus norvegicus (rat))
Institute For Bioorganic Research
Curated by ChEMBL
LigandPNGBDBM50071201((R)-2-[(R)-2-(2-{(R)-2-[(R)-2-Amino-3-(4-hydroxy-p...)
Affinity DataIC50:  6.30nM. Assay description: Binding affinity against rat mu-opioid receptor expressed in CHO cells by competitive inhibition of 1 nM [3H]DAMGO
In DepthDetails ArticlePubMed