BDBM50071329 2-[4-((S)-2-Amino-2-carboxy-ethyl)-phenoxy]-2-fluoro-malonic acid::CHEMBL431555::FLUOROMALONYL TYROSINE
SMILES N[C@@H](Cc1ccc(OC(F)(C(O)=O)C(O)=O)cc1)C(O)=O
InChI Key InChIKey=AXIAXCQZCZMCQW-QMMMGPOBSA-N
Data  1 IC50
PDB links: 1 PDB ID matches this monomer.
  Tab Delimited (TSV)   2D SDfile   Computed 3D by Vconf -m prep SDfile
Find this compound or compounds like it in BindingDB:
Activity Spreadsheet -- Enzyme Inhibition Constant Data from BindingDB
Found 1 hit for monomerid = 50071329
TargetTyrosine-protein phosphatase non-receptor type 1(Homo sapiens (Human))
National Cancer Institute-Bethesda
Curated by ChEMBL
LigandPNGBDBM50071329(2-[4-((S)-2-Amino-2-carboxy-ethyl)-phenoxy]-2-fluo...)
Affinity DataIC50:  1.00E+3nM. Assay description: Compound concentration that cause 50% inhibition of protein-tyrosine phosphatase 1B (PTP1B)