BDBM50071354 CHEMBL69551::N-[4-(1H-Imidazol-4-yl)-butyl]-benzenesulfonamide
SMILES O=S(=O)(NCCCCc1cnc[nH]1)c1ccccc1
InChI Key InChIKey=VWXDKWVRNDPMQM-UHFFFAOYSA-N
Data  1 KI
  Tab Delimited (TSV)   2D SDfile   Computed 3D by Vconf -m prep SDfile
Find this compound or compounds like it in BindingDB:
Activity Spreadsheet -- Enzyme Inhibition Constant Data from BindingDB
Found 1 hit for monomerid = 50071354
TargetHistamine H3 receptor(GUINEA PIG)
Schering-Plough Research Institute
Curated by ChEMBL
LigandPNGBDBM50071354(CHEMBL69551 | N-[4-(1H-Imidazol-4-yl)-butyl]-benze...)
Affinity DataKi:  11nM. Assay description: Inhibition of [3H]-Nalpha-methylhistamine binding to H3 receptor in guinea-pig brain membranes
In DepthDetails ArticlePubMed