BDBM50071358 3-Chloro-N-[4-(1H-imidazol-4-yl)-butyl]-benzenesulfonamide::CHEMBL308244
SMILES Clc1cccc(c1)S(=O)(=O)NCCCCc1cnc[nH]1
InChI Key InChIKey=LKBPUDKMARKKOS-UHFFFAOYSA-N
Data  1 KI
  Tab Delimited (TSV)   2D SDfile   Computed 3D by Vconf -m prep SDfile
Find this compound or compounds like it in BindingDB:
Activity Spreadsheet -- Enzyme Inhibition Constant Data from BindingDB
Found 1 hit for monomerid = 50071358
TargetHistamine H3 receptor(GUINEA PIG)
Schering-Plough Research Institute
Curated by ChEMBL
LigandPNGBDBM50071358(3-Chloro-N-[4-(1H-imidazol-4-yl)-butyl]-benzenesul...)
Affinity DataKi:  8.5nM. Assay description: Inhibition of [3H]Nalpha-methylhistamine binding to H3 receptor in guinea-pig brain membranes
In DepthDetails ArticlePubMed