BDBM50071622 CHEMBL3410596
SMILES CCOC(=O)c1sc(Nc2ccc(C)c(Cl)c2)nc1-c1ccccc1
InChI Key InChIKey=CVZNJBZNWNMDTG-UHFFFAOYSA-N
Data  1 IC50
PDB links: 1 PDB ID matches this monomer.
  Tab Delimited (TSV)   2D SDfile   Computed 3D by Vconf -m prep SDfile
Find this compound or compounds like it in BindingDB:
Activity Spreadsheet -- Enzyme Inhibition Constant Data from BindingDB
Found 1 hit for monomerid = 50071622
TargetDihydroorotate dehydrogenase (quinone), mitochondrial(Homo sapiens (Human))
East China University Of Science And Techology
Curated by ChEMBL
LigandPNGBDBM50071622(CHEMBL3410596)
Affinity DataIC50:  35nM. Assay description: Inhibition of human DHODH using dihydroorotate substrate by DCIP assay