BDBM50071862 10-(2-Amino-3-phenyl-propionylamino)-7-benzyl-3,3-dimethyl-6,9-dioxo-1,2-dithia-5,8-diaza-cycloundecane-4-carboxylic acid::CHEMBL2370162
SMILES CC1(C)SSC[C@@H](NC(=O)[C@@H](N)Cc2ccccc2)C(=O)N[C@@H](Cc2ccccc2)C(=O)N[C@@H]1C(O)=O
InChI Key InChIKey=MVYCTWGUOLFOFH-UWHLTILDSA-N
Data  2 KI
  Tab Delimited (TSV)   2D SDfile   Computed 3D by Vconf -m prep SDfile
Find this compound or compounds like it in BindingDB:
Activity Spreadsheet -- Enzyme Inhibition Constant Data from BindingDB
Found 2 hits for monomerid = 50071862
TargetDelta-type opioid receptor(Homo sapiens (Human))
University Of Michigan
Curated by ChEMBL
LigandPNGBDBM50071862(10-(2-Amino-3-phenyl-propionylamino)-7-benzyl-3,3-...)
Affinity DataKi:  42nM. Assay description: Binding affinity against Opioid receptor delta 1
In DepthDetails ArticlePubMed
TargetMu-type opioid receptor(GUINEA PIG)
University Of Michigan
Curated by ChEMBL
LigandPNGBDBM50071862(10-(2-Amino-3-phenyl-propionylamino)-7-benzyl-3,3-...)
Affinity DataKi:  610nM. Assay description: Binding affinity against mu opioid receptor
In DepthDetails ArticlePubMed