BDBM50072371 1-[1-(4-Ethoxy-2-methoxy-benzoyl)-piperidin-4-yl]-1,4-dihydro-benzo[d][1,3]oxazin-2-one::CHEMBL104530
SMILES CCOc1ccc(C(=O)N2CCC(CC2)N2C(=O)OCc3ccccc23)c(OC)c1
InChI Key InChIKey=YUYHHCMCZVLAMB-UHFFFAOYSA-N
Data  1 KI
  Tab Delimited (TSV)   2D SDfile   Computed 3D by Vconf -m prep SDfile
Find this compound or compounds like it in BindingDB:
Activity Spreadsheet -- Enzyme Inhibition Constant Data from BindingDB
Found 1 hit for monomerid = 50072371
TargetOxytocin receptor(Homo sapiens (Human))
Merck Research Laboratories
Curated by ChEMBL
LigandPNGBDBM50072371(1-[1-(4-Ethoxy-2-methoxy-benzoyl)-piperidin-4-yl]-...)
Affinity DataKi:  15nM. Assay description: Binding affinity against cloned human oxytocin receptor from human embryonic kidney cells
In DepthDetails ArticlePubMed