BDBM50072519 (6S,8aS)-2-[(S)-2-Amino-3-(4-fluoro-phenyl)-propionyl]-4-oxo-octahydro-pyrrolo[1,2-a]pyrazine-6-carboxylic acid [4-guanidino-1-(thiazole-2-carbonyl)-butyl]-amide::CHEMBL316551
SMILES N[C@@H](Cc1ccc(F)cc1)C(=O)N1C[C@@H]2CC[C@H](N2C(=O)C1)C(=O)NC(CCCNC(N)=N)C(=O)c1nccs1
InChI Key InChIKey=ZMFLEXYDURICTN-DQTVCYTJSA-N
Data  1 KI
  Tab Delimited (TSV)   2D SDfile   Computed 3D by Vconf -m prep SDfile
Find this compound or compounds like it in BindingDB:
Activity Spreadsheet -- Enzyme Inhibition Constant Data from BindingDB
Found 1 hit for monomerid = 50072519
TargetProthrombin(Homo sapiens (Human))
Biochem Therapeutic
Curated by ChEMBL
LigandPNGBDBM50072519((6S,8aS)-2-[(S)-2-Amino-3-(4-fluoro-phenyl)-propio...)
Affinity DataKi:  3nM. Assay description: Binding affinity of the compound against thrombin
In DepthDetails ArticlePubMed