BDBM50072524 (6S,8aS)-4-Oxo-2-[3-(2-trifluoromethyl-phenyl)-propionyl]-octahydro-pyrrolo[1,2-a]pyrazine-6-carboxylic acid [4-guanidino-1-(thiazole-2-carbonyl)-butyl]-amide::CHEMBL109883
SMILES NC(=N)NCCCC(NC(=O)[C@@H]1CC[C@H]2CN(CC(=O)N12)C(=O)CCc1ccccc1C(F)(F)F)C(=O)c1nccs1
InChI Key InChIKey=URNLSCCWWKUSQB-SPFPWHRZSA-N
Data  1 KI
  Tab Delimited (TSV)   2D SDfile   Computed 3D by Vconf -m prep SDfile
Find this compound or compounds like it in BindingDB:
Activity Spreadsheet -- Enzyme Inhibition Constant Data from BindingDB
Found 1 hit for monomerid = 50072524
TargetProthrombin(Homo sapiens (Human))
Biochem Therapeutic
Curated by ChEMBL
LigandPNGBDBM50072524((6S,8aS)-4-Oxo-2-[3-(2-trifluoromethyl-phenyl)-pro...)
Affinity DataKi:  0.5nM. Assay description: Binding affinity of the compound against thrombin
In DepthDetails ArticlePubMed