BDBM50072739 (6S,8aS)-4-Oxo-2-(3-phenyl-propionyl)-octahydro-pyrrolo[1,2-a]pyrazine-6-carboxylic acid [(R)-1-(1-carbamimidoyl-piperidin-3-ylmethyl)-2-oxo-2-thiazol-2-yl-ethyl]-amide::CHEMBL116297
SMILES NC(=N)N1CCCC(C[C@@H](NC(=O)[C@@H]2CC[C@H]3CN(CC(=O)N23)C(=O)CCc2ccccc2)C(=O)c2nccs2)C1
InChI Key InChIKey=MBTNEZJRUOUOHC-GLCCWIKHSA-N
Data  2 IC50
  Tab Delimited (TSV)   2D SDfile   Computed 3D by Vconf -m prep SDfile
Find this compound or compounds like it in BindingDB:
Activity Spreadsheet -- Enzyme Inhibition Constant Data from BindingDB
Found 2 hits for monomerid = 50072739
TargetProthrombin(Homo sapiens (Human))
Warner-Lambert
Curated by ChEMBL
LigandPNGBDBM50072739((6S,8aS)-4-Oxo-2-(3-phenyl-propionyl)-octahydro-py...)
Affinity DataIC50:  137nM. Assay description: In vitro inhibitory activity against thrombin(FIIa)
In DepthDetails ArticlePubMed
TargetSerine protease 1(Homo sapiens (Human))
Warner-Lambert
Curated by ChEMBL
LigandPNGBDBM50072739((6S,8aS)-4-Oxo-2-(3-phenyl-propionyl)-octahydro-py...)
Affinity DataIC50:  3.16E+4nM. Assay description: In vitro inhibitory activity against against trypsin
In DepthDetails ArticlePubMed