BDBM50072991 7-Nitro-1,2,3,4-tetrahydro-isoquinoline::7-nitro-1,2,3,4-tetrahydroisoquinoline::CHEMBL281289
SMILES [O-][N+](=O)c1ccc2CCNCc2c1
InChI Key InChIKey=YPRWYZSUBZXORL-UHFFFAOYSA-N
Data  7 KI
  Tab Delimited (TSV)   2D SDfile   Computed 3D by Vconf -m prep SDfile
Find this compound or compounds like it in BindingDB:
Activity Spreadsheet -- Enzyme Inhibition Constant Data from BindingDB
Found 7 hits for monomerid = 50072991
TargetPhenylethanolamine N-methyltransferase(Bos taurus (bovine))
The University Of Kansas
Curated by ChEMBL
LigandPNGBDBM50072991(7-Nitro-1,2,3,4-tetrahydro-isoquinoline | 7-nitro-...)
Affinity DataKi:  120nM. Assay description: Inhibition of bovine PNMT by radiochemical assay
In DepthDetails ArticlePubMed
TargetPhenylethanolamine N-methyltransferase(Homo sapiens (Human))
University Of Kansas
Curated by ChEMBL
LigandPNGBDBM50072991(7-Nitro-1,2,3,4-tetrahydro-isoquinoline | 7-nitro-...)
Affinity DataKi:  120nM. Assay description: Binding affinity to human PNMT
In DepthDetails ArticlePubMed
TargetPhenylethanolamine N-methyltransferase(Bos taurus (bovine))
The University Of Kansas
Curated by ChEMBL
LigandPNGBDBM50072991(7-Nitro-1,2,3,4-tetrahydro-isoquinoline | 7-nitro-...)
Affinity DataKi:  410nM. Assay description: In vitro inhibitory activity against bovine adrenal phenylethanolamine N-methyl-transferase (PNMT)
In DepthDetails ArticlePubMed
TargetPhenylethanolamine N-methyltransferase(Bos taurus (bovine))
The University Of Kansas
Curated by ChEMBL
LigandPNGBDBM50072991(7-Nitro-1,2,3,4-tetrahydro-isoquinoline | 7-nitro-...)
Affinity DataKi:  1.70E+3nM. Assay description: Inhibitory activity against bovine adrenal phenylethanolamine N-methyl-transferase (PNMT)
In DepthDetails ArticlePubMed
TargetPhenylethanolamine N-methyltransferase(Homo sapiens (Human))
University Of Kansas
Curated by ChEMBL
LigandPNGBDBM50072991(7-Nitro-1,2,3,4-tetrahydro-isoquinoline | 7-nitro-...)
Affinity DataKi:  2.36E+3nM. Assay description: Binding affinity to human free PNMT
In DepthDetails ArticlePubMed
TargetAlpha-2A adrenergic receptor(Homo sapiens (Human))
University Of Kansas
Curated by ChEMBL
LigandPNGBDBM50072991(7-Nitro-1,2,3,4-tetrahydro-isoquinoline | 7-nitro-...)
Affinity DataKi:  3.20E+3nM. Assay description: Binding affinity against human alpha 2A adrenergic receptor in CHO cells using [3H]-RX-821002 as radioligand
In DepthDetails ArticlePubMed
LigandPNGBDBM50072991(7-Nitro-1,2,3,4-tetrahydro-isoquinoline | 7-nitro-...)
Affinity DataKi:  4.65E+3nM. Assay description: Inhibition of [3H]clonidine binding to the rat alpha-2-adrenoceptor
In DepthDetails ArticlePubMed