BDBM50074233 4,6-Diethyl-5-ethylsulfanylcarbonyl-2-phenyl-nicotinic acid propyl ester::CHEMBL111086
SMILES CCCOC(=O)c1c(CC)c(C(=O)SCC)c(CC)nc1-c1ccccc1
InChI Key InChIKey=GWWOBTIPLRGIDS-UHFFFAOYSA-N
Data  3 KI
  Tab Delimited (TSV)   2D SDfile   Computed 3D by Vconf -m prep SDfile
Find this compound or compounds like it in BindingDB:
Activity Spreadsheet -- Enzyme Inhibition Constant Data from BindingDB
Found 3 hits for monomerid = 50074233
TargetAdenosine receptor A3(Homo sapiens (Human))
National Institute Of Diabetes
Curated by ChEMBL
LigandPNGBDBM50074233(4,6-Diethyl-5-ethylsulfanylcarbonyl-2-phenyl-nicot...)
Affinity DataKi:  8.29nM. Assay description: Displacement of specific [125 I]AB-MECA binding at human Adenosine A3 receptor expressed in HEK cells
In DepthDetails ArticlePubMed
TargetAdenosine receptor A3(Rattus norvegicus)
National Institute Of Diabetes
Curated by ChEMBL
LigandPNGBDBM50074233(4,6-Diethyl-5-ethylsulfanylcarbonyl-2-phenyl-nicot...)
Affinity DataKi:  183nM. Assay description: Displacement of specific [125I]-AB-MECA binding at rat Adenosine A3 receptor stably expressed in CHO cells
In DepthDetails ArticlePubMed
TargetAdenosine receptor A1(Rattus norvegicus (rat))
National Institute Of Diabetes
Curated by ChEMBL
LigandPNGBDBM50074233(4,6-Diethyl-5-ethylsulfanylcarbonyl-2-phenyl-nicot...)
Affinity DataKi:  7.77E+3nM. Assay description: Displacement of specific [3H]-CGS- 21680R-PIA binding to Adenosine A1 receptor in rat brain membranes.
In DepthDetails ArticlePubMed