BDBM50074235 2-Ethyl-3-ethylsulfanylcarbonyl-1-methyl-6-phenyl-5-propoxycarbonyl-4-propyl-pyridinium; iodide::CHEMBL440720
SMILES CCCOC(=O)c1c(CCC)c(C(=O)SCC)c(CC)[n+](C)c1-c1ccccc1
InChI Key InChIKey=NYUOBVIALFMKHV-UHFFFAOYSA-N
Data  3 KI
  Tab Delimited (TSV)   2D SDfile   Computed 3D by Vconf -m prep SDfile
Find this compound or compounds like it in BindingDB:
Activity Spreadsheet -- Enzyme Inhibition Constant Data from BindingDB
Found 3 hits for monomerid = 50074235
TargetAdenosine receptor A3(Homo sapiens (Human))
National Institute Of Diabetes
Curated by ChEMBL
LigandPNGBDBM50074235(2-Ethyl-3-ethylsulfanylcarbonyl-1-methyl-6-phenyl-...)
Affinity DataKi:  2.02E+3nM. Assay description: Displacement of specific [125 I]AB-MECA binding at human Adenosine A3 receptor expressed in HEK cells
In DepthDetails ArticlePubMed
TargetAdenosine receptor A3(Homo sapiens (Human))
National Institute Of Diabetes
Curated by ChEMBL
LigandPNGBDBM50074235(2-Ethyl-3-ethylsulfanylcarbonyl-1-methyl-6-phenyl-...)
Affinity DataKi:  2.02E+3nM. Assay description: Displacement of [3H]-AB-MECA from human Adenosine A3 receptor expressed in HEK cells
In DepthDetails ArticlePubMed
TargetAdenosine receptor A3(Rattus norvegicus)
National Institute Of Diabetes
Curated by ChEMBL
LigandPNGBDBM50074235(2-Ethyl-3-ethylsulfanylcarbonyl-1-methyl-6-phenyl-...)
Affinity DataKi:  4.26E+3nM. Assay description: Displacement of specific [125I]-AB-MECA binding at rat Adenosine A3 receptor stably expressed in CHO cells
In DepthDetails ArticlePubMed