BDBM50076341 (S)-N-Methyl-3-pentafluorophenyl-2-[3-(5-thioxo-4,5-dihydro-[1,3,4]thiadiazol-2-yl)-ureido]-propionamide::2-[3-(5-MERCAPTO-[1,3,4]THIADIAZOL-2YL)-UREIDO]-N-METHYL-3-PENTAFLUOROPHENYL-PROPIONAMIDE::CHEMBL290140::PNU-142372
SMILES CNC(=O)[C@H](Cc1c(F)c(F)c(F)c(F)c1F)NC(=O)Nc1nnc(S)s1
InChI Key InChIKey=HZAXNPDJVFUGDS-BYPYZUCNSA-N
Data  4 KI
PDB links: 1 PDB ID matches this monomer.
  Tab Delimited (TSV)   2D SDfile   Computed 3D by Vconf -m prep SDfile
Find this compound or compounds like it in BindingDB:
Activity Spreadsheet -- Enzyme Inhibition Constant Data from BindingDB
Found 4 hits for monomerid = 50076341
TargetStromelysin-1(Homo sapiens (Human))
Pharmacia And Upjohn
Curated by ChEMBL
LigandPNGBDBM50076341((S)-N-Methyl-3-pentafluorophenyl-2-[3-(5-thioxo-4,...)
Affinity DataKi:  18nM. Assay description: Binding affinity for matrix metalloproteinase-3
TargetStromelysin-1(Homo sapiens (Human))
Pharmacia And Upjohn
Curated by ChEMBL
LigandPNGBDBM50076341((S)-N-Methyl-3-pentafluorophenyl-2-[3-(5-thioxo-4,...)
Affinity DataKi:  18nM. Assay description: Inhibition of human stromelysin-1 (MMP-3)
Target72 kDa type IV collagenase(Homo sapiens (Human))
University Of California San Francisco
Curated by ChEMBL
LigandPNGBDBM50076341((S)-N-Methyl-3-pentafluorophenyl-2-[3-(5-thioxo-4,...)
Affinity DataKi:  3.00E+3nM. Assay description: Inhibition of human Matrix metalloproteinase-2 (gelatinase-A)
In DepthDetails ArticlePubMed
TargetInterstitial collagenase(Homo sapiens (Human))
Pharmacia And Upjohn
Curated by ChEMBL
LigandPNGBDBM50076341((S)-N-Methyl-3-pentafluorophenyl-2-[3-(5-thioxo-4,...)
Affinity DataKi:  3.00E+3nM. Assay description: Binding affinity for matrix metalloproteinase-1
In DepthDetails ArticlePubMed