BDBM50078467 6-[(4-Bromo-phenylamino)-methyl]-5-methyl-pyrido[2,3-d]pyrimidine-2,4-diamine::CHEMBL80065
SMILES Cc1c(CNc2ccc(Br)cc2)cnc2nc(N)nc(N)c12
InChI Key InChIKey=XPCJHZXMQUMYFF-UHFFFAOYSA-N
Data  6 IC50
  Tab Delimited (TSV)   2D SDfile   Computed 3D by Vconf -m prep SDfile
Find this compound or compounds like it in BindingDB:
Activity Spreadsheet -- Enzyme Inhibition Constant Data from BindingDB
Found 6 hits for monomerid = 50078467
TargetBifunctional dihydrofolate reductase-thymidylate synthase(Toxoplasma gondii)
Duquesne University
Curated by ChEMBL
LigandPNGBDBM50078467(6-[(4-Bromo-phenylamino)-methyl]-5-methyl-pyrido[2...)
Affinity DataIC50:  9.5nM. Assay description: Inhibition of dihydrofolate reductase (DHFR) from Toxoplasma gondii(tg)
In DepthDetails ArticlePubMed
TargetDihydrofolate reductase(Rattus norvegicus (rat))
Duquesne University
Curated by ChEMBL
LigandPNGBDBM50078467(6-[(4-Bromo-phenylamino)-methyl]-5-methyl-pyrido[2...)
Affinity DataIC50:  34.9nM. Assay description: Inhibition of dihydrofolate reductase (DHFR) from rat liver (rl)
In DepthDetails ArticlePubMed
TargetDihydrofolate reductase(Rattus norvegicus (rat))
Duquesne University
Curated by ChEMBL
LigandPNGBDBM50078467(6-[(4-Bromo-phenylamino)-methyl]-5-methyl-pyrido[2...)
Affinity DataIC50:  34.9nM. Assay description: Inhibition of rat liver dihydrofolate reductase
In DepthDetails ArticlePubMed
TargetBifunctional dihydrofolate reductase-thymidylate synthase(Toxoplasma gondii)
Duquesne University
Curated by ChEMBL
LigandPNGBDBM50078467(6-[(4-Bromo-phenylamino)-methyl]-5-methyl-pyrido[2...)
Affinity DataIC50:  9.5nM. Assay description: Inhibition of Toxoplasma gondii dihydrofolate reductase
In DepthDetails ArticlePubMed
TargetDihydrofolate reductase(Pneumocystis carinii)
Duquesne University
Curated by ChEMBL
LigandPNGBDBM50078467(6-[(4-Bromo-phenylamino)-methyl]-5-methyl-pyrido[2...)
Affinity DataIC50:  80.8nM. Assay description: Inhibition of Pneumocystis carinii dihydrofolate reductase
In DepthDetails ArticlePubMed
TargetDihydrofolate reductase(Pneumocystis carinii)
Duquesne University
Curated by ChEMBL
LigandPNGBDBM50078467(6-[(4-Bromo-phenylamino)-methyl]-5-methyl-pyrido[2...)
Affinity DataIC50:  80.8nM. Assay description: Inhibition of dihydrofolate reductase (DHFR) from Pneumocystis carinii(pc)
In DepthDetails ArticlePubMed