BDBM50079259 3-(3-Carbamimidoyl-phenyl)-4,5-dihydro-isoxazole-5-carboxylic acid (2'-sulfamoyl-biphenyl-4-yl)-amide; TFA::CHEMBL301729::CHEMBL92523
SMILES NC(=N)c1cccc(c1)C1=NOC(C1)C(=O)Nc1ccc(cc1)-c1ccccc1S(N)(=O)=O
InChI Key InChIKey=SZLKLAYGGJRRDH-UHFFFAOYSA-N
Data  4 KI
  Tab Delimited (TSV)   2D SDfile   Computed 3D by Vconf -m prep SDfile
Find this compound or compounds like it in BindingDB:
Activity Spreadsheet -- Enzyme Inhibition Constant Data from BindingDB
Found 4 hits for monomerid = 50079259
TargetCoagulation factor X(Homo sapiens (Human))
Bristol-Myers Squibb
Curated by ChEMBL
LigandPNGBDBM50079259(3-(3-Carbamimidoyl-phenyl)-4,5-dihydro-isoxazole-5...)
Affinity DataKi:  7.20nM. Assay description: Binding affinity against the Factor Xa (FXa)
In DepthDetails ArticlePubMed
TargetCoagulation factor X(Homo sapiens (Human))
Bristol-Myers Squibb
Curated by ChEMBL
LigandPNGBDBM50079259(3-(3-Carbamimidoyl-phenyl)-4,5-dihydro-isoxazole-5...)
Affinity DataKi:  7.20nM. Assay description: Binding affinity towards human purified Coagulation factor Xa (FXa)
In DepthDetails ArticlePubMed
TargetSerine protease 1(Homo sapiens (Human))
Dupont Pharmaceuticals
Curated by ChEMBL
LigandPNGBDBM50079259(3-(3-Carbamimidoyl-phenyl)-4,5-dihydro-isoxazole-5...)
Affinity DataKi:  83nM. Assay description: Binding affinity towards trypsin obtained from human purified enzymes
In DepthDetails ArticlePubMed
TargetProthrombin(Homo sapiens (Human))
Dupont Pharmaceuticals
Curated by ChEMBL
LigandPNGBDBM50079259(3-(3-Carbamimidoyl-phenyl)-4,5-dihydro-isoxazole-5...)
Affinity DataKi:  3.90E+3nM. Assay description: Binding affinity towards thrombin obtained from human purified enzymes
In DepthDetails ArticlePubMed