BDBM50079609 4-Fluoro-N-(4-methyl-pyrimidin-2-yl)-benzenesulfonamide::CHEMBL300344
SMILES Cc1ccnc(NS(=O)(=O)c2ccc(F)cc2)n1
InChI Key InChIKey=VDIMUFJJXCMDEQ-UHFFFAOYSA-N
Data  1 IC50
  Tab Delimited (TSV)   2D SDfile   Computed 3D by Vconf -m prep SDfile
Find this compound or compounds like it in BindingDB:
Activity Spreadsheet -- Enzyme Inhibition Constant Data from BindingDB
Found 1 hit for monomerid = 50079609
TargetAcetolactate synthase, chloroplastic(Arabidopsis thaliana)
Nankai University
Curated by ChEMBL
LigandPNGBDBM50079609(4-Fluoro-N-(4-methyl-pyrimidin-2-yl)-benzenesulfon...)
Affinity DataIC50:  3.90E+4nM. Assay description: Inhibitory activity against Acetolactate synthase (ALS) enzyme by using the rape-root growth method
In DepthDetails ArticlePubMed