BDBM50081244 4-Benzoylsulfamoyl-2-{4-[(2,7-dimethyl-4-oxo-3,4-dihydro-quinazolin-6-ylmethyl)-prop-2-ynyl-amino]-2-fluoro-benzoylamino}-butyric acid::CHEMBL127175
SMILES Cc1nc2cc(C)c(CN(CC#C)c3ccc(C(=O)NC(CCS(=O)(=O)NC(=O)c4ccccc4)C(O)=O)c(F)c3)cc2c(=O)[nH]1
InChI Key InChIKey=WQFDTMOOWGQQEX-UHFFFAOYSA-N
Data  1 IC50
  Tab Delimited (TSV)   2D SDfile   Computed 3D by Vconf -m prep SDfile
Find this compound or compounds like it in BindingDB:
Activity Spreadsheet -- Enzyme Inhibition Constant Data from BindingDB
Found 1 hit for monomerid = 50081244
TargetThymidylate synthase(Mus musculus)
Astrazeneca
Curated by ChEMBL
LigandPNGBDBM50081244(4-Benzoylsulfamoyl-2-{4-[(2,7-dimethyl-4-oxo-3,4-d...)
Affinity DataIC50:  64nM. Assay description: Inhibition of isolated thymidylate synthase partially purified from L1210 mouse leukemia cells
In DepthDetails ArticlePubMed