BDBM50081262 2-{4-[(2,7-Dimethyl-4-oxo-3,4-dihydro-quinazolin-6-ylmethyl)-prop-2-ynyl-amino]-2-fluoro-benzoylamino}-6-(1H-tetrazol-5-ylsulfanyl)-hexanoic acid::CHEMBL338644
SMILES Cc1nc2cc(C)c(CN(CC#C)c3ccc(C(=O)NC(CCCCSc4nnn[nH]4)C(O)=O)c(F)c3)cc2c(=O)[nH]1
InChI Key InChIKey=VZYWXVNPFBVQHB-UHFFFAOYSA-N
Data  1 IC50
  Tab Delimited (TSV)   2D SDfile   Computed 3D by Vconf -m prep SDfile
Find this compound or compounds like it in BindingDB:
Activity Spreadsheet -- Enzyme Inhibition Constant Data from BindingDB
Found 1 hit for monomerid = 50081262
TargetThymidylate synthase(Mus musculus)
Astrazeneca
Curated by ChEMBL
LigandPNGBDBM50081262(2-{4-[(2,7-Dimethyl-4-oxo-3,4-dihydro-quinazolin-6...)
Affinity DataIC50:  3.40nM. Assay description: Inhibition of isolated thymidylate synthase partially purified from L1210 mouse leukemia cells
In DepthDetails ArticlePubMed