BDBM50081272 (S)-5-Acetylsulfamoyl-2-{4-[(2,7-dimethyl-4-oxo-3,4-dihydro-quinazolin-6-ylmethyl)-prop-2-ynyl-amino]-2-fluoro-benzoylamino}-pentanoic acid::CHEMBL127598
SMILES CC(=O)NS(=O)(=O)CCC[C@H](NC(=O)c1ccc(cc1F)N(CC#C)Cc1cc2c(cc1C)nc(C)[nH]c2=O)C(O)=O
InChI Key InChIKey=BLWSJJILTQSUCR-DEOSSOPVSA-N
Data  1 IC50
  Tab Delimited (TSV)   2D SDfile   Computed 3D by Vconf -m prep SDfile
Find this compound or compounds like it in BindingDB:
Activity Spreadsheet -- Enzyme Inhibition Constant Data from BindingDB
Found 1 hit for monomerid = 50081272
TargetThymidylate synthase(Mus musculus)
Astrazeneca
Curated by ChEMBL
LigandPNGBDBM50081272((S)-5-Acetylsulfamoyl-2-{4-[(2,7-dimethyl-4-oxo-3,...)
Affinity DataIC50:  2.20nM. Assay description: Inhibition of isolated thymidylate synthase partially purified from L1210 mouse leukemia cells
In DepthDetails ArticlePubMed