BDBM50081340 4-(4-Oxo-4H-quinazolin-3-yl)-butyric acid ethyl ester::CHEMBL124743
SMILES CCOC(=O)CCCn1cnc2ccccc2c1=O
InChI Key InChIKey=YZMWXTKPHGJKNC-UHFFFAOYSA-N
Data  1 IC50
  Tab Delimited (TSV)   2D SDfile   Computed 3D by Vconf -m prep SDfile
Find this compound or compounds like it in BindingDB:
Activity Spreadsheet -- Enzyme Inhibition Constant Data from BindingDB
Found 1 hit for monomerid = 50081340
TargetTumor necrosis factor(Homo sapiens (Human))
University Of California
Curated by ChEMBL
LigandPNGBDBM50081340(4-(4-Oxo-4H-quinazolin-3-yl)-butyric acid ethyl es...)
Affinity DataIC50: >2.50E+4nM. Assay description: The compound was tested in vitro for inhibitory activity against Tumor necrosis factor alpha from human PMBC cell line by ELISA test.
In DepthDetails ArticlePubMed