BDBM50081352 4-(6,7-Dimethoxy-5-nitro-4-oxo-4H-quinazolin-3-yl)-butyric acid ethyl ester::CHEMBL127149
SMILES CCOC(=O)CCCn1cnc2cc(OC)c(OC)c([N+]([O-])=O)c2c1=O
InChI Key InChIKey=UPTXQTWHXTYVCX-UHFFFAOYSA-N
Data  1 IC50
  Tab Delimited (TSV)   2D SDfile   Computed 3D by Vconf -m prep SDfile
Find this compound or compounds like it in BindingDB:
Activity Spreadsheet -- Enzyme Inhibition Constant Data from BindingDB
Found 1 hit for monomerid = 50081352
TargetTumor necrosis factor(Homo sapiens (Human))
University Of California
Curated by ChEMBL
LigandPNGBDBM50081352(4-(6,7-Dimethoxy-5-nitro-4-oxo-4H-quinazolin-3-yl)...)
Affinity DataIC50:  1.10E+4nM. Assay description: The compound was tested in vitro for inhibitory activity against Tumor necrosis factor alpha from human PMBC cell line by ELISA test.
In DepthDetails ArticlePubMed