BDBM50081360 4-(6,7-Dimethoxy-2-phenylamino-quinazolin-4-yloxy)-butyric acid ethyl ester::CHEMBL126805
SMILES CCOC(=O)CCCOc1nc(Nc2ccccc2)nc2cc(OC)c(OC)cc12
InChI Key InChIKey=NZXZEYGXXZAAEE-UHFFFAOYSA-N
Data  1 IC50
  Tab Delimited (TSV)   2D SDfile   Computed 3D by Vconf -m prep SDfile
Find this compound or compounds like it in BindingDB:
Activity Spreadsheet -- Enzyme Inhibition Constant Data from BindingDB
Found 1 hit for monomerid = 50081360
TargetTumor necrosis factor(Homo sapiens (Human))
University Of California
Curated by ChEMBL
LigandPNGBDBM50081360(4-(6,7-Dimethoxy-2-phenylamino-quinazolin-4-yloxy)...)
Affinity DataIC50: >2.50E+4nM. Assay description: The compound was tested in vitro for inhibitory activity against Tumor necrosis factor alpha from human PMBC cell line by ELISA test.
In DepthDetails ArticlePubMed