BDBM50081636 CHEMBL3422108
SMILES CC(C)CNCc1c(sc2c(C3CCCCC3)c(-c3ccccc3)n(CC(=O)N(C)C3CCN(C3)C(C)C)c12)C(O)=O
InChI Key InChIKey=DBAWVRYWKTVMEZ-UHFFFAOYSA-N
Data  1 IC50
  Tab Delimited (TSV)   2D SDfile   Computed 3D by Vconf -m prep SDfile
Find this compound or compounds like it in BindingDB:
Activity Spreadsheet -- Enzyme Inhibition Constant Data from BindingDB
Found 1 hit for monomerid = 50081636
TargetGenome polyprotein(Hepatitis C virus genotype 1b (isolate BK) (HCV))
Shandong University
Curated by ChEMBL
LigandPNGBDBM50081636(CHEMBL3422108)
Affinity DataIC50:  11nM. Assay description: Inhibition of HCV genotype 1b BK NS5B expressed in Escherichia coli BL21 (DE3) after 1 hr
In DepthDetails ArticlePubMed